cersat/general#142 Clean .gitlab-ci.yml

6 jobs for poetry_mkdocs in 11 minutes and 44 seconds (queued for 2 seconds)
Status Name Job ID Coverage
  Quality
failed flake8 #14913
cerbere-runner allowed to fail

00:03:41

passed pylint #14914
cerbere-runner

00:04:16

 
  Tests
failed python3.7 #14915
cerbere-runner allowed to fail

00:03:58

failed python3.8 #14916
cerbere-runner allowed to fail

00:03:54

failed python3.9 #14917
cerbere-runner allowed to fail

00:03:10

 
  Sonarqube
passed sonarqube #14918
cerbere-runner

00:00:18

 
Name Stage Failure
failed
flake8 Quality
cerbere/feature/trajectory.py:29:1: D102 Missing docstring in public method
cerbere/feature/trajectory.py:31:1: W391 blank line at end of file
cerbere/feature/trajectoryprofile.py:2:1: D200 One-line docstring should fit on one line with quotes
cerbere/feature/trajectoryprofile.py:2:1: D212 Multi-line docstring summary should start at the first line
cerbere/feature/trajectoryprofile.py:17:1: D212 Multi-line docstring summary should start at the first line
cerbere/feature/trajectoryprofile.py:25:1: D107 Missing docstring in __init__
cerbere/feature/trajectoryprofile.py:39:1: D102 Missing docstring in public method
Cleaning up file based variables
ERROR: Job failed: exit code 1
failed
python3.9 Tests
      1073│         except CalledProcessError as e:
→ 1074│ raise EnvCommandError(e, input=input_)
1075│
1076│ return decode(output)
1077│
1078│ def execute(self, bin, *args, **kwargs):

Cleaning up file based variables
ERROR: Job failed: exit code 1
failed
python3.7 Tests
FAILED tests/test_ghrsstncdataset_amsr2.py::GHRSSTNCDatasetL2PChecker::test_read_global_attributes
FAILED tests/test_ghrsstncdataset_amsr2.py::GHRSSTNCDatasetL2PChecker::test_read_global_dimensions
FAILED tests/test_ghrsstncdataset_amsr2.py::GHRSSTNCDatasetL2PChecker::test_read_lat
FAILED tests/test_ghrsstncdataset_amsr2.py::GHRSSTNCDatasetL2PChecker::test_read_lon
FAILED tests/test_ghrsstncdataset_amsr2.py::GHRSSTNCDatasetL2PChecker::test_read_time
FAILED tests/test_ghrsstncdataset_amsr2.py::GHRSSTNCDatasetL2PChecker::test_read_time_coverage
============ 69 failed, 193 passed, 171 skipped, 1 warning in 8.32s ============
Cleaning up file based variables
ERROR: Job failed: exit code 1
failed
python3.8 Tests
FAILED tests/test_ghrsstncdataset_amsr2.py::GHRSSTNCDatasetL2PChecker::test_read_global_attributes
FAILED tests/test_ghrsstncdataset_amsr2.py::GHRSSTNCDatasetL2PChecker::test_read_global_dimensions
FAILED tests/test_ghrsstncdataset_amsr2.py::GHRSSTNCDatasetL2PChecker::test_read_lat
FAILED tests/test_ghrsstncdataset_amsr2.py::GHRSSTNCDatasetL2PChecker::test_read_lon
FAILED tests/test_ghrsstncdataset_amsr2.py::GHRSSTNCDatasetL2PChecker::test_read_time
FAILED tests/test_ghrsstncdataset_amsr2.py::GHRSSTNCDatasetL2PChecker::test_read_time_coverage
================= 69 failed, 193 passed, 171 skipped in 8.11s ==================
Cleaning up file based variables
ERROR: Job failed: exit code 1